game-dev

Open full view…

I have linked error xcode

Artem Sherbachuk
Thu, 03 Dec 2015 15:56:17 GMT

ld: warning: directory not found for option '-L/Users/artem/Downloads/SpriteDraggerX-master/lib/cocos2d/x/lib/Debu g-iOS/iphonesimulator' ld: library not found for -lcocos2dx-prebuilt clang: error: linker command failed with exit code 1 (use -v to see invocation) when I did before rapidgame prebuild --verbose I have an error: error: /Applications/Xcode-beta.app/Contents/Developer/Toolchains/XcodeDefaul t.xctoolchain/usr/bin/libtool: can't open file: /Applications/Xcode-beta.app/Contents/Developer/Platforms/MacOSX.platf orm/Developer/SDKs/MacOSX10.11.sdk/usr/lib/libsqlite3.dylib (No such file or directory) ** BUILD FAILED ** The following build commands failed: Libtool /Users/artem/Library/Developer/Xcode/DerivedData/cocos2dx-prebuilt-adv wimtjrpvobacnuatawumfzguv/Build/Products/Debug/libcocos2d\ Mac.a normal x86_64 (1 failure)

Nathanael Weiss
Wed, 13 Jan 2016 23:00:42 GMT

so were you able to successfully build libcocos2dx-prebuilt.a?